{"text_format":"1","workbook":"xlsx","n_sheets":2,"sheets":["Transportrechner","Berechnung"],"not_rendered":{"charts":0,"images":4,"macros":1,"external_links":0,"defined_names":1,"comments":0,"pivot_tables":0},"unopened":[],"bounds":{"document_bytes":16777216,"sheet_cells":100000,"rows_first":2000,"rows_last":500,"rows_between":2000,"halvings":0,"cell_chars":16384,"cell_head_chars":4096},"cells_cut":0,"cells_raw":0,"read":"whole","date_system":"1900"}

{"sheet":"Transportrechner","index":0,"n_rows":16,"n_cols":21,"rows_kept":16,"cut":false,"hidden":false,"merged":[[1,12,1,17],[2,12,5,17],[7,12,14,17],[15,12,20,17],[4,4,9,6],[6,7,8,7],[5,8,8,9]]}
[]
[null,null,null,null,null,null,null,null,null,null,null,null,"Willkommen beim Trächtigkeitstransportrechners des Landes Salzburg."]
[null,null,null,null,null,null,null,null,null,null,null,null,"Dieses Programm soll die Einschätzung ob ein trächtiges Rind noch gesetzeskonform Transportiert werden darf erleichtern."]
[null,null,"Rinderrasse"]
[]
[null,null,null,null,null,null,null,null,{"$f":"IFERROR(IF(Berechnung!$G$7<66.3,\"Transport zulässig! Gute Fahrt!\",IF(Berechnung!$G$7<90,\"Kein Transport zur Schlachtung! Andere Transporte zulässig\",\"Kein Transport zulässig!\")),\" \")","v":" "}]
[null,null,"Belegdatum"]
[null,null,null,null,null,null,null,null,null,null,null,null,"Trächtige Tiere dürfen  nach §6 TschG Abs. (2c) Die Tötung sowie das Verbringen zum Zweck der Schlachtung von Säugetieren, die sich offensichtlich im letzten Drittel der Trächtigkeit befinden, ist verboten. Das Verbot gilt nicht, wenn die Tötung eines solchen Tieres im Einzelfall nach tierärztlicher Indikation geboten ist und überwiegende Gründe des Tierschutzes der Tötung bzw. dem Verbringen zum Zweck der Schlachtung nicht entgegenstehen.",null,null,null,null,null,null,null,{"$f":"Berechnung!G7","v":{"$error":"#VALUE!"}}]
[]
[null,null,"Transportdatum"]
[]
[]
[]
[]
[]
[null,null,null,null,null,null,null,null,null,null,null,null,"Ebenso dürfen Tiere nach der VO (EG) 1/2005 ANH.I, Kap.I, Z 2, Abs. c) nicht mehr verbracht werden wenn sie sich in einem fortgeschrittenen Gestationsstadium (90% oder mehr) befinden."]

{"sheet":"Berechnung","index":1,"n_rows":7,"n_cols":7,"rows_kept":7,"cut":false,"hidden":true,"merged":[]}
["Rasse auswählen",null,null,"Datum Heute"]
["Fleckvieh",290,null,{"$f":"TODAY()","v":"2025-06-04"}]
["Braunvieh",291]
["Pinzgauer",287]
["Grauvieh",288]
["Holstein Friesian",283,null,{"$f":"IF(ISBLANK(Transportrechner!$C$8),\" \",IF(ISBLANK(Transportrechner!$C$11),_xlfn.DAYS(Transportrechner!C8,$D$2),_xlfn.DAYS(Transportrechner!$C$11,Transportrechner!$C$8)))","v":" "},"Tage zu Datum Heute"]
["Andere",285,null,{"$f":"IF(D6<0,D6*-1,D6)","v":" "},{"$f":"VLOOKUP(Transportrechner!$C$5,Berechnung!$A$2:$B$20,2,FALSE)","v":{"$error":"#N/A"}},null,{"$f":"(D7/E7)*100","v":{"$error":"#VALUE!"}}]